Skip to content

chore(deps): bump undici #2004

chore(deps): bump undici

chore(deps): bump undici #2004

Triggered via pull request September 28, 2026 23:09
Status Failure
Total duration 1m 11s
Artifacts –

nodejs.yml

on: pull_request
Test on Node.js  /  prepare-node-matrix
4s
Test on Node.js / prepare-node-matrix
Lint using ESLint
28s
Lint using ESLint
Matrix: Test on Node.js / test
Fit to window
Zoom out
Zoom in

Annotations

12 errors and 14 notices
Test on Node.js / test (26, macos-latest, experimental)
Process completed with exit code 1.
posts to the resume handler without redirecting the POST to a GET: test/unit/ci_resume.test.js#L665
AssertionError [ERR_ASSERTION]: Expected values to be strictly equal: false !== true at TestContext.<anonymous> (file:///Users/runner/work/node-core-utils/node-core-utils/test/unit/ci_resume.test.js:665:12) at process.processTicksAndRejections (node:internal/process/task_queues:104:5) at async Test.run (node:internal/test_runner/test:1409:7) at async Suite.processPendingSubtests (node:internal/test_runner/test:974:7) { generatedMessage: true, code: 'ERR_ASSERTION', actual: false, expected: true, operator: 'strictEqual', diff: 'simple' }
Test on Node.js / test (24, ubuntu-latest)
Process completed with exit code 1.
posts to the resume handler without redirecting the POST to a GET: test/unit/ci_resume.test.js#L665
AssertionError [ERR_ASSERTION]: Expected values to be strictly equal: false !== true at TestContext.<anonymous> (file:///home/runner/work/node-core-utils/node-core-utils/test/unit/ci_resume.test.js:665:12) at process.processTicksAndRejections (node:internal/process/task_queues:104:5) at async Test.run (node:internal/test_runner/test:1409:7) at async Suite.processPendingSubtests (node:internal/test_runner/test:974:7) { generatedMessage: true, code: 'ERR_ASSERTION', actual: false, expected: true, operator: 'strictEqual', diff: 'simple' }
Test on Node.js / test (22, macos-latest)
Process completed with exit code 1.
posts to the resume handler without redirecting the POST to a GET: test/unit/ci_resume.test.js#L665
AssertionError [ERR_ASSERTION]: Expected values to be strictly equal: false !== true at TestContext.<anonymous> (file:///Users/runner/work/node-core-utils/node-core-utils/test/unit/ci_resume.test.js:665:12) at process.processTicksAndRejections (node:internal/process/task_queues:103:5) at async Test.run (node:internal/test_runner/test:1054:7) at async Suite.processPendingSubtests (node:internal/test_runner/test:744:7) { generatedMessage: true, code: 'ERR_ASSERTION', actual: false, expected: true, operator: 'strictEqual', diff: 'simple' }
Test on Node.js / test (22, ubuntu-latest)
Process completed with exit code 1.
posts to the resume handler without redirecting the POST to a GET: test/unit/ci_resume.test.js#L665
AssertionError [ERR_ASSERTION]: Expected values to be strictly equal: false !== true at TestContext.<anonymous> (file:///home/runner/work/node-core-utils/node-core-utils/test/unit/ci_resume.test.js:665:12) at process.processTicksAndRejections (node:internal/process/task_queues:103:5) at async Test.run (node:internal/test_runner/test:1054:7) at async Suite.processPendingSubtests (node:internal/test_runner/test:744:7) { generatedMessage: true, code: 'ERR_ASSERTION', actual: false, expected: true, operator: 'strictEqual', diff: 'simple' }
Test on Node.js / test (26, ubuntu-latest, experimental)
Process completed with exit code 1.
posts to the resume handler without redirecting the POST to a GET: test/unit/ci_resume.test.js#L665
AssertionError [ERR_ASSERTION]: Expected values to be strictly equal: false !== true at TestContext.<anonymous> (file:///home/runner/work/node-core-utils/node-core-utils/test/unit/ci_resume.test.js:665:12) at process.processTicksAndRejections (node:internal/process/task_queues:104:5) at async Test.run (node:internal/test_runner/test:1409:7) at async Suite.processPendingSubtests (node:internal/test_runner/test:974:7) { generatedMessage: true, code: 'ERR_ASSERTION', actual: false, expected: true, operator: 'strictEqual', diff: 'simple' }
Test on Node.js / test (24, macos-latest)
Process completed with exit code 1.
posts to the resume handler without redirecting the POST to a GET: test/unit/ci_resume.test.js#L665
AssertionError [ERR_ASSERTION]: Expected values to be strictly equal: false !== true at TestContext.<anonymous> (file:///Users/runner/work/node-core-utils/node-core-utils/test/unit/ci_resume.test.js:665:12) at process.processTicksAndRejections (node:internal/process/task_queues:104:5) at async Test.run (node:internal/test_runner/test:1404:7) at async Suite.processPendingSubtests (node:internal/test_runner/test:969:7) { generatedMessage: true, code: 'ERR_ASSERTION', actual: false, expected: true, operator: 'strictEqual', diff: 'simple' }
Test on Node.js / prepare-node-matrix
"The ubuntu-latest label will migrate to Ubuntu 26 beginning October 19, 2026. For more information, see https://github.com/actions/runner-images/issues/14748"
Lint using ESLint
"The ubuntu-latest label will migrate to Ubuntu 26 beginning October 19, 2026. For more information, see https://github.com/actions/runner-images/issues/14748"
Test on Node.js / test (26, macos-latest, experimental)
Total Tests: 692 Suites πŸ“‚: 97 Passed βœ…: 691 Failed ❌: 1 Canceled 🚫: 0 Skipped ⏭️: 0 Todo πŸ“: 0 Duration πŸ•: 12438.386ms
Test on Node.js / test (26, macos-latest, experimental)
Due to capacity constraints, jobs targeting macOS arm64 runners may experience longer queue times.
Test on Node.js / test (24, ubuntu-latest)
Total Tests: 692 Suites πŸ“‚: 97 Passed βœ…: 691 Failed ❌: 1 Canceled 🚫: 0 Skipped ⏭️: 0 Todo πŸ“: 0 Duration πŸ•: 16143.576ms
Test on Node.js / test (24, ubuntu-latest)
"The ubuntu-latest label will migrate to Ubuntu 26 beginning October 19, 2026. For more information, see https://github.com/actions/runner-images/issues/14748"
Test on Node.js / test (22, macos-latest)
Total Tests: 692 Suites πŸ“‚: 97 Passed βœ…: 691 Failed ❌: 1 Canceled 🚫: 0 Skipped ⏭️: 0 Todo πŸ“: 0 Duration πŸ•: 14998.675ms
Test on Node.js / test (22, macos-latest)
Due to capacity constraints, jobs targeting macOS arm64 runners may experience longer queue times.
Test on Node.js / test (22, ubuntu-latest)
Total Tests: 692 Suites πŸ“‚: 97 Passed βœ…: 691 Failed ❌: 1 Canceled 🚫: 0 Skipped ⏭️: 0 Todo πŸ“: 0 Duration πŸ•: 22858.461ms
Test on Node.js / test (22, ubuntu-latest)
"The ubuntu-latest label will migrate to Ubuntu 26 beginning October 19, 2026. For more information, see https://github.com/actions/runner-images/issues/14748"
Test on Node.js / test (26, ubuntu-latest, experimental)
Total Tests: 692 Suites πŸ“‚: 97 Passed βœ…: 691 Failed ❌: 1 Canceled 🚫: 0 Skipped ⏭️: 0 Todo πŸ“: 0 Duration πŸ•: 20406.935ms
Test on Node.js / test (26, ubuntu-latest, experimental)
"The ubuntu-latest label will migrate to Ubuntu 26 beginning October 19, 2026. For more information, see https://github.com/actions/runner-images/issues/14748"
Test on Node.js / test (24, macos-latest)
Total Tests: 692 Suites πŸ“‚: 97 Passed βœ…: 691 Failed ❌: 1 Canceled 🚫: 0 Skipped ⏭️: 0 Todo πŸ“: 0 Duration πŸ•: 20208.737ms
Test on Node.js / test (24, macos-latest)
Due to capacity constraints, jobs targeting macOS arm64 runners may experience longer queue times.